{"text_format":"1","workbook":"xlsx","n_sheets":8,"sheets":["Coversheet","Modelling inputs","Growth (Residential)","Growth (Non-Residential)","Growth (Impervious Area)","BAICR Charge Lookup","Adopted Charge Revenue Forecast","LGIP Cash Flow Analysis"],"not_rendered":{"charts":2,"images":0,"macros":1,"external_links":0,"defined_names":13,"comments":0,"pivot_tables":0},"unopened":[],"bounds":{"document_bytes":16777216,"sheet_cells":100000,"rows_first":2000,"rows_last":500,"rows_between":2000,"halvings":0,"cell_chars":16384,"cell_head_chars":4096},"cells_cut":0,"cells_raw":0,"read":"whole","date_system":"1900"}

{"sheet":"Coversheet","index":0,"n_rows":12,"n_cols":3,"rows_kept":12,"cut":false,"hidden":false,"merged":[]}
[null,"Brisbane City Council"]
[null,"Local Government Infrastructure Plan (LGIP)"]
[]
[]
[null,"Anticipated Charges Revenue and Future Cash Flows Model"]
[]
[null,"Version:","LGIP A1b draft"]
[null,"Date:","2022-08-22"]
[null,"Author:","Brisbane City Council"]
[]
[]
[null,"Model flow diagram (click to follow)"]

{"sheet":"Modelling inputs","index":1,"n_rows":60,"n_cols":7,"rows_kept":60,"cut":false,"hidden":false,"merged":[[15,1,23,1]]}
["Local Government Infrastructure Plan"]
["Brisbane City Council"]
[{"$f":"Coversheet!C8","v":"2022-08-22"}]
["Input"]
["Formula",null,"General modelling inputs"]
[]
[null,null,"Model parameters",null,"Value",null,"BCC Comment/Source"]
[]
[null,null,"Modelling timframes"]
[]
[null,null,"Modelling start year:",null,2021,null,"Base values for all costs"]
[null,null,"Modelling end year:",null,2036,null,"N/A"]
[null,null,"Modelling term (years):",null,{"$f":"E12-E11","v":15},null,"N/A"]
[]
[null,null,"Financial inputs"]
[]
[null,null,"Average 10 Year Bond Rate:",null,null,null,"Not used"]
[null,null,"Basic Margin on 10 Yr. Bond Rate:",null,null,null,"Not used"]
[]
[null,null,"Calculated WACC:",null,{"$f":"E18+E17","v":0},null,"Not used"]
{"$rows_left_out":41}
{"sheet":"Growth (Residential)","index":2,"n_rows":57,"n_cols":22,"rows_kept":57,"cut":false,"hidden":false,"merged":[]}
["Local Government Infrastructure Plan"]
["Brisbane City Council"]
[{"$f":"Coversheet!C8","v":"2022-08-22"},null,null,"Input"]
[null,null,null,"Formula"]
[1.1000000000000001,"Anticipated Residential Growth - Census Year"]
[]
[null,"Development type(1)","Unit of demand(2)",2021,2026,2031,2036]
[null,"Attached Dwelling","Number of dwellings: 1 or 2 bedroom dwelling",117020.11202931163,127933.99215436389,141843.37688922521,159073.0881060953]
[null,"Attached Dwelling","Number of dwellings: 3 or more bedroom dwelling",56624.887970688382,61906.007845636108,68636.623110774803,76973.911893904689]
[null,"Excluded Attached Dwelling(4)",null,{"$f":"D11-D8-D9","v":8453.9999999999927},{"$f":"E11-E8-E9","v":16010},19244.999999999985,21860.000000000015]
[null,"Total Attached Dwelling",null,182099,205850,229725,257907]
[null,"Detached Dwelling","Number of dwellings: 1 or 2 bedroom dwelling",24796.506454765211,25088.048706475336,25283.148022424524,25575.164583654787]
[null,"Detached Dwelling","Number of dwellings: 3 or more bedroom dwelling",288878.49354523479,292274.95129352465,294547.85197757545,297949.83541634522]
[null,"Excluded Detached Dwelling(4)",null,{"$f":"D15-D12-D13","v":968},{"$f":"E15-E12-E13","v":1000},1020,1020]
[null,"Total Detached Dwelling",null,314643,318363,320851,324545]
[null,"Short term accommodation","Number of bedrooms: Bedroom that is not within a suite",10737.995354590346,11408.792758918335,11778.159803735842,12142.432787356538]
[null,"Short term accommodation","Number of suites: Suite with 1 or 2 bedrooms",5642.5511711193376,5995.0386284506239,6189.131881658911,6380.548331607125]
[null,"Short term accommodation","Number of suites: Suite with 3 or more bedrooms",1685.7790763691476,1791.0888843320886,1849.0765454449679,1906.2644798401732]
[null,"Long term accommodation","Number of bedrooms: Bedroom that is not within a suite",506.00395722226392,537.61378101859168,555.01937490956448,572.18492258717993]
[null,"Long term accommodation","Number of suites: Suite with 1 or 2 bedrooms",1659.8914126134266,1763.5840306747134,1820.6812043601988,1876.9909323301019]
{"$rows_left_out":38}
{"sheet":"Growth (Non-Residential)","index":3,"n_rows":62,"n_cols":22,"rows_kept":62,"cut":false,"hidden":false,"merged":[]}
["Local Government Infrastructure Plan"]
["Brisbane City Council"]
[{"$f":"Coversheet!C8","v":"2022-08-22"},null,null,"Input"]
[null,null,null,"Formula"]
[2.1,"Anticipated Non Residential Growth - Census Year"]
[]
[null,"Development type(1)","Unit of demand(2)",2021,2026,2031,2036]
[null,"Food Services, Arts & Recreation","m2 GFA",1500534,1590104,1673068,1741945]
[null,"Community - Education","m2 GFA",3667784,4113498,4519897,4880222]
[null,"Community - Health","m2 GFA",948051,1063259,1168305,1261442]
[null,"Community - Other","m2 GFA",1119039,1255026,1379018,1488953]
[null,"Industry - General","m2 GFA",507969,534186,552178,563738]
[null,"Industry - Heavy","m2 GFA",294936,310158,320605,327317]
[null,"Industry - Light","m2 GFA",6160939,6478910,6697124,6837334]
[null,"Industry - Other","m2 GFA",117140,123186,127335,130000]
[null,"Office","m2 GFA",5970560,6394623,6826675,7189283]
[null,"Retail","m2 GFA",3391391,3593829,3781338,3937009]
[null,"Showroom, Retail Warehouse & Bulky Goods","m2 GFA",947121,1003656,1056022,1099497]
[null,"Warehouse, Bulk Stores & Logistics","m2 GFA",8377728,8810108,9106839,9297499]
[null,"Rural","m2 GFA",5710,6012,6234,6417]
{"$rows_left_out":43}
{"sheet":"Growth (Impervious Area)","index":4,"n_rows":23,"n_cols":22,"rows_kept":23,"cut":false,"hidden":false,"merged":[]}
["Local Government Infrastructure Plan"]
["Brisbane City Council"]
[{"$f":"Coversheet!C8","v":"2022-08-22"},null,null,"Input"]
[null,null,null,"Formula"]
[3.1,"Anticipated Impervious Area Growth - Census Year"]
[]
[null,"Development type(1)","Unit of demand(2)",2021,2026,2031,2036]
[null,"Non-residential Stormwater Impervious Area","Impervious area in m2",68310898.856099099,70604374.165407389,72949608.38750641,75066714.188829347]
[]
[3.2,"Anticipated Non Residential Growth - Annualised (3)"]
[]
[null,"Development type","Unit of demand",2021,2022,2023,2024,2025,2026,2027,2028,2029,2030,2031,2032,2033,2034,2035,2036,null,"Charge Code","Applied Charge"]
[null,"Non-residential Stormwater Impervious Area","Impervious area in m2",{"$f":"D8","v":68310898.856099099},{"$f":"($E8-$D8)/5","v":458695.06186165812},{"$f":"($E8-$D8)/5","v":458695.06186165812},458695.06186165812,458695.06186165812,458695.06186165812,{"$f":"($F8-$E8)/5","v":469046.84441980423},{"$f":"($F8-$E8)/5","v":469046.84441980423},469046.84441980423,469046.84441980423,469046.84441980423,{"$f":"($G8-$F8)/5","v":423421.16026458738},{"$f":"($G8-$F8)/5","v":423421.16026458738},423421.16026458738,423421.16026458738,423421.16026458738,null,"T01",{"$f":"VLOOKUP(U13,'BAICR Charge Lookup'!A:F,6,FALSE)","v":10.91}]
[]
[2.2999999999999998,"Anticipated Revenue - Applied Charge"]
[]
[null,"Development type","Unit of demand",2021,2022,2023,2024,2025,2026,2027,2028,2029,2030,2031,2032,2033,2034,2035,2036]
[null,"Non-residential Stormwater Impervious Area","Impervious area in m2","N/A",{"$f":"E13*$V13*(1+PPI)^(E$17-BaseYear)","v":5095469.4188902481},5188234.3368736031,5282688.0747283027,5378861.3780489117,5476785.5521649858,5702342.17578441,5806155.4382659001,5911858.6598439934,6019486.2479277328,6129073.2363258628,5633606.830438775,5736168.7403657977,5840597.8280502465,5946928.0861584069,6055194.1262057116]
[]
["Notes:"]
{"$rows_left_out":4}
{"sheet":"BAICR Charge Lookup","index":5,"n_rows":133,"n_cols":7,"rows_kept":133,"cut":false,"hidden":false,"merged":[]}
["Local Government Infrastructure Plan"]
["Brisbane City Council"]
[{"$f":"Coversheet!C8","v":"2022-08-22"}]
[]
["Charges categories, sub-categories, demand units, and applied adopted charge (AAC) rate - Lookup table"]
["Brisbane Adopted Infrastructure Charges Resolution (No.10) 2022"]
[]
["4.1 Reconfiguration of a Lot"]
["Code","Category","Sub Category","Demand Unit",null,"AICR10 Charge","Alt. Charge"]
["A01","01 Residential (Reconfiguration of a Lot)","Residential Lot","Number of residential lots",null,15270.71,0]
["A02","02 Non-Residential (Reconfiguration of a Lot)","Non-Residential Lot","Number of non-residential lots",null,15270.71,0]
[]
["4.2 Material Change of Use (Residential - Transport, Community Purposes, and Waterways)"]
["Code","Category","Sub Category","Demand Unit",null,"AICR10 Charge","Alt. Charge"]
["B01","01 Residential (Material Change of Use/Building Work)","Caretaker's accommodation - 1 or 2 bedroom dwelling","Number of dwellings: 1 or 2 bedroom dwelling",null,10907.66,0]
["B02","01 Residential (Material Change of Use/Building Work)","Caretaker's accommodation - 3 or more bedroom dwelling","Number of dwellings: 3 or more bedroom dwelling",null,15270.71,0]
["B03","01 Residential (Material Change of Use/Building Work)","Dwelling house - 1 or 2 bedroom dwelling","Number of dwellings: 1 or 2 bedroom dwelling",null,10907.66,0]
["B04","01 Residential (Material Change of Use/Building Work)","Dwelling house - 3 or more bedroom dwelling","Number of dwellings: 3 or more bedroom dwelling",null,15270.71,0]
["B05","01 Residential (Material Change of Use/Building Work)","Dual occupancy - 1 or 2 bedroom dwelling","Number of dwellings: 1 or 2 bedroom dwelling",null,10907.66,0]
["B06","01 Residential (Material Change of Use/Building Work)","Dual occupancy - 3 or more bedroom dwelling","Number of dwellings: 3 or more bedroom dwelling",null,15270.71,0]
{"$rows_left_out":114}
{"sheet":"Adopted Charge Revenue Forecast","index":6,"n_rows":16,"n_cols":21,"rows_kept":16,"cut":false,"hidden":false,"merged":[]}
["Local Government Infrastructure Plan"]
["Brisbane City Council"]
[{"$f":"Coversheet!C8","v":"2022-08-22"},null,null,null,null,null,null,null,"Input"]
[null,null,null,null,null,null,null,null,"Formula"]
[5.0999999999999996,"Anticipated infrastructure charges revenue ($'000)"]
[]
[]
[null,null,null,"Model year",null,0,1,2,3,4,5,6,7,8,9,10]
[null,"Development type",null,"2021 NPV",null,"2021 (1)",2022,2023,2024,2025,2026,2027,2028,2029,2030,2031,2032,2033,2034,2035,2036]
[null,"Residential",null,{"$f":"F10+NPV(WACC,G10:P10)","v":451975.42843327235},null,0,{"$f":"HLOOKUP(G9,'Growth (Residential)'!$E$40:$S$51,12,FALSE)/1000","v":53800.580963260669},{"$f":"HLOOKUP(H9,'Growth (Residential)'!$E$40:$S$51,12,FALSE)/1000","v":54780.040571439538},{"$f":"HLOOKUP(I9,'Growth (Residential)'!$E$40:$S$51,12,FALSE)/1000","v":55777.331606470638},{"$f":"HLOOKUP(J9,'Growth (Residential)'!$E$40:$S$51,12,FALSE)/1000","v":56792.778696119072},{"$f":"HLOOKUP(K9,'Growth (Residential)'!$E$40:$S$51,12,FALSE)/1000","v":57826.712378119206},{"$f":"HLOOKUP(L9,'Growth (Residential)'!$E$40:$S$51,12,FALSE)/1000","v":66122.851686732116},{"$f":"HLOOKUP(M9,'Growth (Residential)'!$E$40:$S$51,12,FALSE)/1000","v":67326.642821422312},{"$f":"HLOOKUP(N9,'Growth (Residential)'!$E$40:$S$51,12,FALSE)/1000","v":68552.349421930994},{"$f":"HLOOKUP(O9,'Growth (Residential)'!$E$40:$S$51,12,FALSE)/1000","v":69800.370467473214},{"$f":"HLOOKUP(P9,'Growth (Residential)'!$E$40:$S$51,12,FALSE)/1000","v":71071.112200829157},{"$f":"HLOOKUP(Q9,'Growth (Residential)'!$E$40:$S$51,12,FALSE)/1000","v":91733.853045156342},{"$f":"HLOOKUP(R9,'Growth (Residential)'!$E$40:$S$51,12,FALSE)/1000","v":93403.90199540295},{"$f":"HLOOKUP(S9,'Growth (Residential)'!$E$40:$S$51,12,FALSE)/1000","v":95104.354808603399},{"$f":"HLOOKUP(T9,'Growth (Residential)'!$E$40:$S$51,12,FALSE)/1000","v":96835.764998403203},{"$f":"HLOOKUP(U9,'Growth (Residential)'!$E$40:$S$51,12,FALSE)/1000","v":98598.69615536982}]
[null,"Non-residential",null,{"$f":"F11+NPV(WACC,G11:P11)","v":284781.80819937127},null,0,{"$f":"HLOOKUP(G9,'Growth (Non-Residential)'!$E$43:$S$57,15,FALSE)/1000","v":36965.268251750378},{"$f":"HLOOKUP(H9,'Growth (Non-Residential)'!$E$43:$S$57,15,FALSE)/1000","v":37638.234723670284},{"$f":"HLOOKUP(I9,'Growth (Non-Residential)'!$E$43:$S$57,15,FALSE)/1000","v":38323.45280077924},{"$f":"HLOOKUP(J9,'Growth (Non-Residential)'!$E$43:$S$57,15,FALSE)/1000","v":39021.145528111432},{"$f":"HLOOKUP(K9,'Growth (Non-Residential)'!$E$43:$S$57,15,FALSE)/1000","v":39731.540011318859},{"$f":"HLOOKUP(L9,'Growth (Non-Residential)'!$E$43:$S$57,15,FALSE)/1000","v":37576.623112628717},{"$f":"HLOOKUP(M9,'Growth (Non-Residential)'!$E$43:$S$57,15,FALSE)/1000","v":38260.719527418616},{"$f":"HLOOKUP(N9,'Growth (Non-Residential)'!$E$43:$S$57,15,FALSE)/1000","v":38957.270172151591},{"$f":"HLOOKUP(O9,'Growth (Non-Residential)'!$E$43:$S$57,15,FALSE)/1000","v":39666.50178072085},{"$f":"HLOOKUP(P9,'Growth (Non-Residential)'!$E$43:$S$57,15,FALSE)/1000","v":40388.645214794597},{"$f":"HLOOKUP(Q9,'Growth (Non-Residential)'!$E$43:$S$57,15,FALSE)/1000","v":41123.935538963633},{"$f":"HLOOKUP(R9,'Growth (Non-Residential)'!$E$43:$S$57,15,FALSE)/1000","v":41872.612097257173},{"$f":"HLOOKUP(S9,'Growth (Non-Residential)'!$E$43:$S$57,15,FALSE)/1000","v":42634.918591051588},{"$f":"HLOOKUP(T9,'Growth (Non-Residential)'!$E$43:$S$57,15,FALSE)/1000","v":43411.103158397542},{"$f":"HLOOKUP(U9,'Growth (Non-Residential)'!$E$43:$S$57,15,FALSE)/1000","v":44201.418454791317}]
[null,"Non-residential (Stormwater)",null,{"$f":"F12+NPV(WACC,G12:P12)","v":40969.597566478173},null,0,{"$f":"HLOOKUP(G9,'Growth (Impervious Area)'!$E$17:$S$18,2,FALSE)/1000","v":5095.4694188902477},{"$f":"HLOOKUP(H9,'Growth (Impervious Area)'!$E$17:$S$18,2,FALSE)/1000","v":5188.2343368736028},{"$f":"HLOOKUP(I9,'Growth (Impervious Area)'!$E$17:$S$18,2,FALSE)/1000","v":5282.688074728303},{"$f":"HLOOKUP(J9,'Growth (Impervious Area)'!$E$17:$S$18,2,FALSE)/1000","v":5378.8613780489113},{"$f":"HLOOKUP(K9,'Growth (Impervious Area)'!$E$17:$S$18,2,FALSE)/1000","v":5476.7855521649853},{"$f":"HLOOKUP(L9,'Growth (Impervious Area)'!$E$17:$S$18,2,FALSE)/1000","v":5702.3421757844098},{"$f":"HLOOKUP(M9,'Growth (Impervious Area)'!$E$17:$S$18,2,FALSE)/1000","v":5806.1554382659006},{"$f":"HLOOKUP(N9,'Growth (Impervious Area)'!$E$17:$S$18,2,FALSE)/1000","v":5911.8586598439933},{"$f":"HLOOKUP(O9,'Growth (Impervious Area)'!$E$17:$S$18,2,FALSE)/1000","v":6019.4862479277326},{"$f":"HLOOKUP(P9,'Growth (Impervious Area)'!$E$17:$S$18,2,FALSE)/1000","v":6129.073236325863},{"$f":"HLOOKUP(Q9,'Growth (Impervious Area)'!$E$17:$S$18,2,FALSE)/1000","v":5633.6068304387754},{"$f":"HLOOKUP(R9,'Growth (Impervious Area)'!$E$17:$S$18,2,FALSE)/1000","v":5736.1687403657979},{"$f":"HLOOKUP(S9,'Growth (Impervious Area)'!$E$17:$S$18,2,FALSE)/1000","v":5840.5978280502468},{"$f":"HLOOKUP(T9,'Growth (Impervious Area)'!$E$17:$S$18,2,FALSE)/1000","v":5946.9280861584066},{"$f":"HLOOKUP(U9,'Growth (Impervious Area)'!$E$17:$S$18,2,FALSE)/1000","v":6055.1941262057117}]
[null,"Total revenue",null,848085.87617912178,null,70359.041980000009,{"$f":"SUM(G10:G12)","v":95861.318633901305},{"$f":"SUM(H10:H12)","v":97606.509631983427},99383.472481978184,101192.78560227941,103035.03794160306,109401.81697514524,111393.51778710682,113421.47825392657,115486.3584961218,117588.83065194961,138491.39541455876,141012.68283302593,143579.87122770524,146193.79624295916,148855.30873636686]
[]
[null,"Notes:"]
[null,"(1) Actual charges revenue for 2020-2021 financial year"]

{"sheet":"LGIP Cash Flow Analysis","index":7,"n_rows":22,"n_cols":22,"rows_kept":22,"cut":false,"hidden":false,"merged":[]}
["Local Government Infrastructure Plan"]
["Brisbane City Council",null,null,null,"Input"]
[{"$f":"Coversheet!C8","v":"2022-08-22"},null,null,null,"Formula"]
[]
[6.1,"LGIP Summary Cash Flow Projections ($,000's)"]
[]
[]
[null,"Cost Category","Sub-category",null,"2021 NPV",null,2021,2022,2023,2024,2025,2026,2027,2028,2029,2030,2031,2032,2033,2034,2035,2036]
[null,"Anticipated Cost (Cap X in $'000)","Local Roads",null,{"$f":"G9+NPV(WACC,H9:Q9)","v":1523002.2445752709},null,null,188723.2378,188723.2378,188723.2378,188723.2378,188723.2378,229128.99619999999,229128.99619999999,229128.99619999999,229128.99619999999,229128.99619999999,245615.13480000003,245615.13480000003,245615.13480000003,245615.13480000003,245615.13480000003]
[null,null,"Pathway",null,588714.37907617085,null,null,84663.515800000008,84663.515800000008,84663.515800000008,84663.515800000008,84663.515800000008,72961.534799999994,72961.534799999994,72961.534799999994,72961.534799999994,72961.534799999994,1178.7868000000001,1178.7868000000001,1178.7868000000001,1178.7868000000001,1178.7868000000001]
[null,null,"Ferry Terminals",null,93169.30525430369,null,null,18973.064999999999,18973.064999999999,18973.064999999999,18973.064999999999,18973.064999999999,4118.7474000000002,4118.7474000000002,4118.7474000000002,4118.7474000000002,4118.7474000000002,4205.6001999999999,4205.6001999999999,4205.6001999999999,4205.6001999999999,4205.6001999999999]
[null,null,"Public Parks",null,522595.25947717909,null,null,64046.793400000002,64046.793400000002,64046.793400000002,64046.793400000002,64046.793400000002,79569.260800000004,79569.260800000004,79569.260800000004,79569.260800000004,79569.260800000004,92637.729000000007,92637.729000000007,92637.729000000007,92637.729000000007,92637.729000000007]
[null,null,"Land for Community Facilities",null,84785.819481237908,null,null,1636.0418,1636.0418,1636.0418,1636.0418,1636.0418,24575.696599999999,24575.696599999999,24575.696599999999,24575.696599999999,24575.696599999999,6240.6625999999997,6240.6625999999997,6240.6625999999997,6240.6625999999997,6240.6625999999997]
[null,null,"Stormwater",null,88537.989821362935,null,null,11571.8804,11571.8804,11571.8804,11571.8804,11571.8804,12519.7246,12519.7246,12519.7246,12519.7246,12519.7246,16036.305400000001,16036.305400000001,16036.305400000001,16036.305400000001,16036.305400000001]
[null,null,"Total Network Costs",null,2900804.9976855256,null,null,{"$f":"SUM(H9:H14)","v":369614.53420000005},369614.53420000005,369614.53420000005,369614.53420000005,369614.53420000005,422873.96039999998,422873.96039999998,422873.96039999998,422873.96039999998,422873.96039999998,365914.21880000003,365914.21880000003,365914.21880000003,365914.21880000003,365914.21880000003]
[null,"Anticipated Charges Revenue ($'000)","Residential",null,{"$f":"G16+NPV(WACC,H16:Q16)","v":451975.42843327235},null,{"$f":"'Adopted Charge Revenue Forecast'!F10","v":0},{"$f":"'Adopted Charge Revenue Forecast'!G10","v":53800.580963260669},{"$f":"'Adopted Charge Revenue Forecast'!H10","v":54780.040571439538},{"$f":"'Adopted Charge Revenue Forecast'!I10","v":55777.331606470638},{"$f":"'Adopted Charge Revenue Forecast'!J10","v":56792.778696119072},{"$f":"'Adopted Charge Revenue Forecast'!K10","v":57826.712378119206},{"$f":"'Adopted Charge Revenue Forecast'!L10","v":66122.851686732116},{"$f":"'Adopted Charge Revenue Forecast'!M10","v":67326.642821422312},{"$f":"'Adopted Charge Revenue Forecast'!N10","v":68552.349421930994},{"$f":"'Adopted Charge Revenue Forecast'!O10","v":69800.370467473214},{"$f":"'Adopted Charge Revenue Forecast'!P10","v":71071.112200829157},{"$f":"'Adopted Charge Revenue Forecast'!Q10","v":91733.853045156342},{"$f":"'Adopted Charge Revenue Forecast'!R10","v":93403.90199540295},{"$f":"'Adopted Charge Revenue Forecast'!S10","v":95104.354808603399},{"$f":"'Adopted Charge Revenue Forecast'!T10","v":96835.764998403203},{"$f":"'Adopted Charge Revenue Forecast'!U10","v":98598.69615536982}]
[null,null,"Non-residential",null,284781.80819937127,null,{"$f":"'Adopted Charge Revenue Forecast'!F11","v":0},{"$f":"'Adopted Charge Revenue Forecast'!G11","v":36965.268251750378},{"$f":"'Adopted Charge Revenue Forecast'!H11","v":37638.234723670284},{"$f":"'Adopted Charge Revenue Forecast'!I11","v":38323.45280077924},{"$f":"'Adopted Charge Revenue Forecast'!J11","v":39021.145528111432},{"$f":"'Adopted Charge Revenue Forecast'!K11","v":39731.540011318859},{"$f":"'Adopted Charge Revenue Forecast'!L11","v":37576.623112628717},{"$f":"'Adopted Charge Revenue Forecast'!M11","v":38260.719527418616},{"$f":"'Adopted Charge Revenue Forecast'!N11","v":38957.270172151591},{"$f":"'Adopted Charge Revenue Forecast'!O11","v":39666.50178072085},{"$f":"'Adopted Charge Revenue Forecast'!P11","v":40388.645214794597},{"$f":"'Adopted Charge Revenue Forecast'!Q11","v":41123.935538963633},{"$f":"'Adopted Charge Revenue Forecast'!R11","v":41872.612097257173},{"$f":"'Adopted Charge Revenue Forecast'!S11","v":42634.918591051588},{"$f":"'Adopted Charge Revenue Forecast'!T11","v":43411.103158397542},{"$f":"'Adopted Charge Revenue Forecast'!U11","v":44201.418454791317}]
[null,null,"Non-residential (Stormwater component)",null,40969.597566478173,null,{"$f":"'Adopted Charge Revenue Forecast'!F12","v":0},{"$f":"'Adopted Charge Revenue Forecast'!G12","v":5095.4694188902477},{"$f":"'Adopted Charge Revenue Forecast'!H12","v":5188.2343368736028},{"$f":"'Adopted Charge Revenue Forecast'!I12","v":5282.688074728303},{"$f":"'Adopted Charge Revenue Forecast'!J12","v":5378.8613780489113},{"$f":"'Adopted Charge Revenue Forecast'!K12","v":5476.7855521649853},{"$f":"'Adopted Charge Revenue Forecast'!L12","v":5702.3421757844098},{"$f":"'Adopted Charge Revenue Forecast'!M12","v":5806.1554382659006},{"$f":"'Adopted Charge Revenue Forecast'!N12","v":5911.8586598439933},{"$f":"'Adopted Charge Revenue Forecast'!O12","v":6019.4862479277326},{"$f":"'Adopted Charge Revenue Forecast'!P12","v":6129.073236325863},{"$f":"'Adopted Charge Revenue Forecast'!Q12","v":5633.6068304387754},{"$f":"'Adopted Charge Revenue Forecast'!R12","v":5736.1687403657979},{"$f":"'Adopted Charge Revenue Forecast'!S12","v":5840.5978280502468},{"$f":"'Adopted Charge Revenue Forecast'!T12","v":5946.9280861584066},{"$f":"'Adopted Charge Revenue Forecast'!U12","v":6055.1941262057117}]
[null,null,"Total revenue",null,848085.87617912178,null,{"$f":"'Adopted Charge Revenue Forecast'!F13","v":70359.041980000009},{"$f":"SUM(H16:H18)","v":95861.318633901305},97606.509631983427,99383.472481978184,101192.78560227941,103035.03794160306,109401.81697514524,111393.51778710682,113421.47825392657,115486.3584961218,117588.83065194961,138491.39541455876,141012.68283302593,143579.87122770524,146193.79624295916,148855.30873636686]
[null,"Annual Cash Flow ($'000)","N/A",null,-2052719.1215064044,null,{"$f":"G19-G15","v":70359.041980000009},{"$f":"H19-H15","v":-273753.21556609875},-272008.02456801664,-270231.06171802187,-268421.74859772064,-266579.496258397,-313472.14342485473,-311480.44261289318,-309452.48214607342,-307387.60190387815,-305285.12974805036,-227422.82338544127,-224901.5359669741,-222334.34757229479,-219720.42255704087,-217058.91006363317]
{"$rows_left_out":2}